Target
Cannabinoid receptor 1
Ligand
BDBM50261099
Substrate
Meas. Tech.
ChEMBL_552268 (CHEMBL995598)
Ki
1510±n/a nM
Citation
 Omura, HKawai, MShima, AIwata, YIto, FMasuda, TOhta, AMakita, NOmoto, KSugimoto, HKikuchi, AIwata, HAndo, K The SAR studies of novel CB2 selective agonists, benzimidazolone derivatives. Bioorg Med Chem Lett 18:3310-4 (2008)  
Target
Name:
Cannabinoid receptor 1
Synonyms:
CANN6 CB-R CNR CNR1_HUMAN Cannabinoid receptor Cannabinoid receptor 1 (brain)
Type:
G Protein-Coupled Receptor (GPCR)
Mol. Mass.:
52868.96
Organism:
Homo sapiens (Human)
Description:
P21554
Residue:
472
  
Inhibitor
Name:
BDBM50261099
Synonyms:
(R)-1-(2-morpholinoethyl)-2-oxo-N-(1,2,3,4-tetrahydronaphthalen-1-yl)-1,2-dihydroquinazoline-3(4H)-carboxamide | CHEMBL521668
Type:
Small organic molecule
Emp. Form.:
C25H30N4O3
Mol. Mass.:
434.5307
SMILES:
O=C(N[C@@H]1CCCc2ccccc12)N1Cc2ccccc2N(CCN2CCOCC2)C1=O
: