Target
Translocator protein
Ligand
BDBM50000766
Substrate
Meas. Tech.
ChEMBL_556776 (CHEMBL961474)
Ki
574±n/a nM
Citation
 Yu, WWang, EVoll, RJMiller, AHGoodman, MM Synthesis, fluorine-18 radiolabeling, and in vitro characterization of 1-iodophenyl-N-methyl-N-fluoroalkyl-3-isoquinoline carboxamide derivatives as potential PET radioligands for imaging peripheral benzodiazepine receptor. Bioorg Med Chem 16:6145-55 (2008)  
Target
Name:
Translocator protein
Synonyms:
Benzodiazepine receptors; peripheral & central Mbr PBR Peripheral benzodiazepine receptor (PBR) TSPO_RAT | Tspo
Type:
Mitochondrion membrane protein
Mol. Mass.:
18945.84
Organism:
Rattus norvegicus (rat)
Description:
Competitive binding experiments were performed on rat kidney mitochondrial membranes.
Residue:
169
  
Inhibitor
Name:
BDBM50000766
Synonyms:
CHEMBL12 US9271961, Diazepam
Type:
Small organic molecule
Emp. Form.:
C16H13ClN2O
Mol. Mass.:
284.74
SMILES:
CN1c2ccc(Cl)cc2C(=NCC1=O)c1ccccc1
: