Target
Acetylcholinesterase
Ligand
BDBM50271473
Substrate
Meas. Tech.
ChEMBL_552457 (CHEMBL1002717)
Ki
0.768±n/a nM
Citation
 Butini, SCampiani, GBorriello, MGemma, SPanico, APersico, MCatalanotti, BRos, SBrindisi, MAgnusdei, MFiorini, INacci, VNovellino, EBelinskaya, TSaxena, AFattorusso, C Exploiting protein fluctuations at the active-site gorge of human cholinesterases: further optimization of the design strategy to develop extremely potent inhibitors. J Med Chem 51:3154-70 (2008)  
Target
Name:
Acetylcholinesterase
Synonyms:
ACES_HUMAN Acetylcholinesterase (AChE) | Acetylcholinesterase (human AChE)
Type:
Enzyme
Mol. Mass.:
67792.70
Organism:
Homo sapiens (Human)
Description:
P22303
Residue:
614
  
Inhibitor
Name:
BDBM50271473
Synonyms:
2,6-bis{[(1,2,3,4-Tetrahydroacridin-9-yl)amino]ethyl}pyridine | CHEMBL521935
Type:
Small organic molecule
Emp. Form.:
C35H37N5
Mol. Mass.:
527.7018
SMILES:
C(Cc1cccc(CCNc2c3CCCCc3nc3ccccc23)n1)Nc1c2CCCCc2nc2ccccc12
: