Target
P2Y purinoceptor 2
Ligand
BDBM50199176
Substrate
Meas. Tech.
ChEMBL_552861 (CHEMBL958066)
EC50
35±n/a nM
Citation
 Ko, HCarter, RLCosyn, LPetrelli, Rde Castro, SBesada, PZhou, YCappellacci, LFranchetti, PGrifantini, MVan Calenbergh, SHarden, TKJacobson, KA Synthesis and potency of novel uracil nucleotides and derivatives as P2Y2 and P2Y6 receptor agonists. Bioorg Med Chem 16:6319-32 (2008)  
Target
Name:
P2Y purinoceptor 2
Synonyms:
ATP receptor P2RY2 P2U purinoceptor 1 P2Y purinoceptor 2 Purinergic receptor | Purinergic receptor P2Y2
Type:
PROTEIN
Mol. Mass.:
42299.21
Organism:
Homo sapiens (Human)
Description:
ChEMBL_1455361
Residue:
377
  
Inhibitor
Name:
BDBM50199176
Synonyms:
2-thio-1-beta-D-ribofuranosyl(3H)pyrimidine-2,4-dione 5'-triphosphate | CHEMBL217803
Type:
Small organic molecule
Emp. Form.:
C9H15N2O14P3S
Mol. Mass.:
500.207
SMILES:
O[C@H]1[C@@H](O)[C@@H](O[C@@H]1COP(O)(=O)OP(O)(=O)OP(O)(O)=O)n1ccc(=O)[nH]c1=S
: