Target
Solute carrier family 22 member 20
Ligand
BDBM50270006
Substrate
Meas. Tech.
ChEMBL_508178 (CHEMBL1008236)
Ki
446000±n/a nM
Citation
 Kaler, GTruong, DMKhandelwal, ANagle, MEraly, SASwaan, PWNigam, SK Structural variation governs substrate specificity for organic anion transporter (OAT) homologs. Potential remote sensing by OAT family members. J Biol Chem 282:23841-53 (2007)  
Target
Name:
Solute carrier family 22 member 20
Synonyms:
Gm963 S22AK_MOUSE | Slc22a20
Type:
PROTEIN
Mol. Mass.:
60953.19
Organism:
Mus musculus
Description:
ChEMBL_508178
Residue:
556
  
Inhibitor
Name:
BDBM50270006
Synonyms:
2-(4-aminobenzamido)acetate | AMINOHIPPURATE
Type:
Small organic molecule
Emp. Form.:
C9H9N2O3
Mol. Mass.:
193.1799
SMILES:
Nc1ccc(cc1)C(=O)NCC([O-])=O
: