Target
Solute carrier family 22 member 20
Ligand
BDBM50412193
Substrate
Meas. Tech.
ChEMBL_508178 (CHEMBL1008236)
Ki
6606.93±n/a nM
Citation
 Kaler, GTruong, DMKhandelwal, ANagle, MEraly, SASwaan, PWNigam, SK Structural variation governs substrate specificity for organic anion transporter (OAT) homologs. Potential remote sensing by OAT family members. J Biol Chem 282:23841-53 (2007)  
Target
Name:
Solute carrier family 22 member 20
Synonyms:
Gm963 S22AK_MOUSE | Slc22a20
Type:
PROTEIN
Mol. Mass.:
60953.19
Organism:
Mus musculus
Description:
ChEMBL_508178
Residue:
556
  
Inhibitor
Name:
BDBM50412193
Synonyms:
CHEMBL1162487
Type:
Small organic molecule
Emp. Form.:
C8H16O2
Mol. Mass.:
144.2114
SMILES:
CCCC[C@@H](CC)C(O)=O
: