Target
Xanthine dehydrogenase/oxidase
Ligand
BDBM50250467
Substrate
Meas. Tech.
ChEMBL_547369 (CHEMBL1023248)
IC50
>100000±n/a nM
Citation
 Cos, PYing, LCalomme, MHu, JPCimanga, KVan Poel, BPieters, LVlietinck, AJVanden Berghe, D Structure-activity relationship and classification of flavonoids as inhibitors of xanthine oxidase and superoxide scavengers. J Nat Prod 61:71-6 (1998)  
Target
Name:
Xanthine dehydrogenase/oxidase
Synonyms:
XD XDHA XO Xanthine dehydrogenase/oxidase | Xanthine oxidase
Type:
Enzyme
Mol. Mass.:
146441.21
Organism:
Homo sapiens (Human)
Description:
P47989
Residue:
1333
  
Inhibitor
Name:
BDBM50250467
Synonyms:
CHEMBL517637 | Cirsimarin
Type:
Small organic molecule
Emp. Form.:
C23H24O11
Mol. Mass.:
476.4301
SMILES:
COc1cc2oc(cc(=O)c2c(O)c1OC)-c1ccc(O[C@@H]2O[C@H](CO)[C@@H](O)[C@H](O)[C@H]2O)cc1
: