Target
Xanthine dehydrogenase/oxidase
Ligand
BDBM50187668
Substrate
Meas. Tech.
ChEMBL_547369 (CHEMBL1023248)
IC50
>100000±n/a nM
Citation
 Cos, PYing, LCalomme, MHu, JPCimanga, KVan Poel, BPieters, LVlietinck, AJVanden Berghe, D Structure-activity relationship and classification of flavonoids as inhibitors of xanthine oxidase and superoxide scavengers. J Nat Prod 61:71-6 (1998)  
Target
Name:
Xanthine dehydrogenase/oxidase
Synonyms:
XD XDHA XO Xanthine dehydrogenase/oxidase | Xanthine oxidase
Type:
Enzyme
Mol. Mass.:
146441.21
Organism:
Homo sapiens (Human)
Description:
P47989
Residue:
1333
  
Inhibitor
Name:
BDBM50187668
Synonyms:
3-Hydroxyflavone 3-hydroxy-2-phenyl-4H-1-benzopyran-4-one 3-hydroxy-2-phenylchromone Flavonol | flavon-3-ol
Type:
Small organic molecule
Emp. Form.:
C15H10O3
Mol. Mass.:
238.2381
SMILES:
Oc1c(oc2ccccc2c1=O)-c1ccccc1
: