Target
Glutamate receptor ionotropic, kainate 2
Ligand
BDBM50252048
Substrate
Meas. Tech.
ChEMBL_487957 (CHEMBL1013088)
Ki
6670±n/a nM
Citation
 Sagot, EPickering, DSPu, XUmberti, MStensbøl, TBNielsen, BChapelet, MBolte, JGefflaut, TBunch, L Chemo-enzymatic synthesis of a series of 2,4-syn-functionalized (S)-glutamate analogues: new insight into the structure-activity relation of ionotropic glutamate receptor subtypes 5, 6, and 7. J Med Chem 51:4093-103 (2008)  
Target
Name:
Glutamate receptor ionotropic, kainate 2
Synonyms:
GRIK2_RAT Glutamate receptor ionotropic kainate 2 Ionotropic glutamate receptor kainate 2/5
Type:
PROTEIN
Mol. Mass.:
102478.61
Organism:
Rattus norvegicus
Description:
ChEMBL_936439
Residue:
908
  
Inhibitor
Name:
BDBM50252048
Synonyms:
(2S,4R)-2-amino-4-(3-methoxy-3-oxopropyl)pentanedioic acid CHEMBL482080
Type:
Small organic molecule
Emp. Form.:
C9H15NO6
Mol. Mass.:
233.2185
SMILES:
COC(=O)CC[C@H](C[C@H](N)C(O)=O)C(O)=O
: