Target
Glutamate receptor ionotropic, kainate 3
Ligand
BDBM50252052
Substrate
Meas. Tech.
ChEMBL_487958 (CHEMBL1013089)
Ki
3236±n/a nM
Citation
 Sagot, EPickering, DSPu, XUmberti, MStensbøl, TBNielsen, BChapelet, MBolte, JGefflaut, TBunch, L Chemo-enzymatic synthesis of a series of 2,4-syn-functionalized (S)-glutamate analogues: new insight into the structure-activity relation of ionotropic glutamate receptor subtypes 5, 6, and 7. J Med Chem 51:4093-103 (2008)  
Target
Name:
Glutamate receptor ionotropic, kainate 3
Synonyms:
GRIK3_RAT Glutamate receptor ionotropic kainate 3 Grik3
Type:
PROTEIN
Mol. Mass.:
104080.46
Organism:
Rattus norvegicus
Description:
ChEMBL_1447329
Residue:
919
  
Inhibitor
Name:
BDBM50252052
Synonyms:
(2S,4R)-2-amino-4-(3-(ethylamino)-3-oxopropyl)pentanedioic acid | CHEMBL479805
Type:
Small organic molecule
Emp. Form.:
C10H18N2O5
Mol. Mass.:
246.2603
SMILES:
CCNC(=O)CC[C@H](C[C@H](N)C(O)=O)C(O)=O
: