Target
Metabotropic glutamate receptor 2
Ligand
BDBM50252048
Substrate
Meas. Tech.
ChEMBL_487963 (CHEMBL1013094)
Ki
>1000000±n/a nM
Citation
 Sagot, EPickering, DSPu, XUmberti, MStensbøl, TBNielsen, BChapelet, MBolte, JGefflaut, TBunch, L Chemo-enzymatic synthesis of a series of 2,4-syn-functionalized (S)-glutamate analogues: new insight into the structure-activity relation of ionotropic glutamate receptor subtypes 5, 6, and 7. J Med Chem 51:4093-103 (2008)  
Target
Name:
Metabotropic glutamate receptor 2
Synonyms:
GPRC1B GRM2_HUMAN Metabotropic glutamate receptor mGlu2 | metabotropic glutamate 2
Type:
Enzyme
Mol. Mass.:
95584.88
Organism:
Homo sapiens (Human)
Description:
Q14416
Residue:
872
  
Inhibitor
Name:
BDBM50252048
Synonyms:
(2S,4R)-2-amino-4-(3-methoxy-3-oxopropyl)pentanedioic acid CHEMBL482080
Type:
Small organic molecule
Emp. Form.:
C9H15NO6
Mol. Mass.:
233.2185
SMILES:
COC(=O)CC[C@H](C[C@H](N)C(O)=O)C(O)=O
: