Target
Metabotropic glutamate receptor 5
Ligand
BDBM50252052
Substrate
Meas. Tech.
ChEMBL_487960 (CHEMBL1013091)
EC50
>100000±n/a nM
Citation
 Sagot, EPickering, DSPu, XUmberti, MStensbøl, TBNielsen, BChapelet, MBolte, JGefflaut, TBunch, L Chemo-enzymatic synthesis of a series of 2,4-syn-functionalized (S)-glutamate analogues: new insight into the structure-activity relation of ionotropic glutamate receptor subtypes 5, 6, and 7. J Med Chem 51:4093-103 (2008)  
Target
Name:
Metabotropic glutamate receptor 5
Synonyms:
GRM5_RAT Grm5 Mglur5 metabotropic glutamate 5/1-C metabotropic glutamate 5a
Type:
Enzyme
Mol. Mass.:
131900.14
Organism:
Rattus norvegicus (Rat)
Description:
P31424
Residue:
1203
  
Inhibitor
Name:
BDBM50252052
Synonyms:
(2S,4R)-2-amino-4-(3-(ethylamino)-3-oxopropyl)pentanedioic acid | CHEMBL479805
Type:
Small organic molecule
Emp. Form.:
C10H18N2O5
Mol. Mass.:
246.2603
SMILES:
CCNC(=O)CC[C@H](C[C@H](N)C(O)=O)C(O)=O
: