Target
Glutamate receptor ionotropic, kainate 2
Ligand
BDBM50240399
Substrate
Meas. Tech.
ChEMBL_487957 (CHEMBL1013088)
Ki
12300±n/a nM
Citation
 Sagot, EPickering, DSPu, XUmberti, MStensbøl, TBNielsen, BChapelet, MBolte, JGefflaut, TBunch, L Chemo-enzymatic synthesis of a series of 2,4-syn-functionalized (S)-glutamate analogues: new insight into the structure-activity relation of ionotropic glutamate receptor subtypes 5, 6, and 7. J Med Chem 51:4093-103 (2008)  
Target
Name:
Glutamate receptor ionotropic, kainate 2
Synonyms:
GRIK2_RAT Glutamate receptor ionotropic kainate 2 Ionotropic glutamate receptor kainate 2/5
Type:
PROTEIN
Mol. Mass.:
102478.61
Organism:
Rattus norvegicus
Description:
ChEMBL_936439
Residue:
908
  
Inhibitor
Name:
BDBM50240399
Synonyms:
(2R,3R,4S)-3-(carboxymethyl)-4-isopropylpyrrolidinium-2-carboxylate (2S,3S,4R)-4-isopropyl-3-(2-oxido-2-oxoethyl)pyrrolidinium-2-carboxylate Dihydrokainate | dihydrokainic acid
Type:
Small organic molecule
Emp. Form.:
C10H17NO4
Mol. Mass.:
215.2463
SMILES:
CC(C)[C@H]1CN[C@@H]([C@H]1CC(O)=O)C(O)=O
: