Target
Nischarin
Ligand
BDBM50240671
Substrate
Meas. Tech.
ChEMBL_490890 (CHEMBL989166)
Ki
28±n/a nM
Citation
 Nikolic, KFilipic, SAgbaba, D QSAR study of imidazoline antihypertensive drugs. Bioorg Med Chem 16:7134-40 (2008)  
Target
Name:
Nischarin
Synonyms:
IRAS Imidazoline receptor 1 (I1R) NISCH Nischarin
Type:
Enzyme
Mol. Mass.:
166571.31
Organism:
Homo sapiens (Human)
Description:
Q9Y2I1
Residue:
1504
  
Inhibitor
Name:
BDBM50240671
Synonyms:
(5-Chloro-benzo[1,2,5]thiadiazol-4-yl)-(4,5-dihydro-1H-imidazol-2-yl)-amine TIZANIDINE | Zanaflex
Type:
Small organic molecule
Emp. Form.:
C9H8ClN5S
Mol. Mass.:
253.711
SMILES:
Clc1ccc2nsnc2c1NC1=NCCN1
: