Target
Cyclin-dependent kinase 1
Ligand
BDBM50262504
Substrate
Meas. Tech.
ChEMBL_513983 (CHEMBL975428)
IC50
>20000±n/a nM
Citation
 Zhang, SMa, JBao, YYang, PZou, LLi, KSun, X Nitrogen-containing flavonoid analogues as CDK1/cyclin B inhibitors: synthesis, SAR analysis, and biological activity. Bioorg Med Chem 16:7128-33 (2008)  
Target
Name:
Cyclin-dependent kinase 1
Synonyms:
CDC2 CDK1 CDKN1 Cell division protein kinase 1 P34CDC2 | p34 protein kinase
Type:
Enzyme Subunit
Mol. Mass.:
34101.08
Organism:
Homo sapiens (Human)
Description:
P06493
Residue:
297
  
Inhibitor
Name:
BDBM50262504
Synonyms:
(E)-1-(2-Hydroxy-4-methoxy-5-(4-methylpiperazin-1-ylmethyl)phenyl)-3-phenylprop-2-en-1-one | CHEMBL479255
Type:
Small organic molecule
Emp. Form.:
C22H26N2O3
Mol. Mass.:
366.4534
SMILES:
COc1cc(O)c(cc1CN1CCN(C)CC1)C(=O)\C=C\c1ccccc1
: