Target
Salicyl-AMP ligase / salicyl-S-ArCP synthetase
Ligand
BDBM50412368
Substrate
Meas. Tech.
ChEMBL_511444 (CHEMBL1003925)
Ki
8260±n/a nM
Citation
 Neres, JLabello, NPSomu, RVBoshoff, HIWilson, DJVannada, JChen, LBarry, CEBennett, EMAldrich, CC Inhibition of siderophore biosynthesis in Mycobacterium tuberculosis with nucleoside bisubstrate analogues: structure-activity relationships of the nucleobase domain of 5'-O-[N-(salicyl)sulfamoyl]adenosine. J Med Chem 51:5349-70 (2008)  
Target
Name:
Salicyl-AMP ligase / salicyl-S-ArCP synthetase
Synonyms:
2,3-dihydroxybenzoate-AMP ligase mbtA
Type:
PROTEIN
Mol. Mass.:
59275.32
Organism:
Mycobacterium tuberculosis
Description:
ChEMBL_423930
Residue:
565
  
Inhibitor
Name:
BDBM50412368
Synonyms:
CHEMBL519775
Type:
Small organic molecule
Emp. Form.:
C24H23N6O8S
Mol. Mass.:
555.54
SMILES:
O[C@@H]1[C@@H](COS(=O)(=O)[N-]C(=O)c2ccccc2O)O[C@H]([C@@H]1O)n1cnc2c(NCc3ccccc3)ncnc12
: