Target
Fatty acid-binding protein, liver
Ligand
BDBM50110590
Substrate
Meas. Tech.
ChEMBL_555395 (CHEMBL964792)
Ki
1860±n/a nM
Citation
 Chuang, SVelkov, THorne, JPorter, CJScanlon, MJ Characterization of the drug binding specificity of rat liver fatty acid binding protein. J Med Chem 51:3755-64 (2008)  
Target
Name:
Fatty acid-binding protein, liver
Synonyms:
FABPL_RAT Fatty acid-binding protein, liver | Liver fatty acid binding protein (rat L-FABP)
Type:
Protein
Mol. Mass.:
14274.39
Organism:
Rattus norvegicus (Rat)
Description:
rat L-FABP
Residue:
127
  
Inhibitor
Name:
BDBM50110590
Synonyms:
2,2-Dimethyl-5-(2,5-dimethylphenoxy)valeriansaeure 2,2-Dimethyl-5-(2,5-xylyloxy)valeric acid CHEMBL457 | GEMFIBROZIL
Type:
Small organic molecule
Emp. Form.:
C15H22O3
Mol. Mass.:
250.3334
SMILES:
Cc1ccc(C)c(OCCCC(C)(C)C(O)=O)c1
: