Target
Sodium-dependent dopamine transporter
Ligand
BDBM50243105
Substrate
Meas. Tech.
ChEMBL_491607 (CHEMBL945183)
IC50
2000±n/a nM
Citation
 Wu, DPontillo, JChing, BHudson, SGao, YFleck, BAGogas, KWade, WS Discovery of a potent, selective, and less flexible selective norepinephrine reuptake inhibitor (sNRI). Bioorg Med Chem Lett 18:4224-7 (2008)  
Target
Name:
Sodium-dependent dopamine transporter
Synonyms:
DA transporter DAT1 Dopamine transporter protein (DAT) SC6A3_HUMAN Sodium-dependent dopamine transporter Solute carrier family 6 member 3
Type:
Multi-pass membrane protein
Mol. Mass.:
68497.11
Organism:
Homo sapiens (Human)
Description:
Q01959
Residue:
620
  
Inhibitor
Name:
BDBM50243105
Synonyms:
CHEMBL530334 | cis-3-phenoxy-2,3-dihydro-1H-inden-1-amine
Type:
Small organic molecule
Emp. Form.:
C15H15NO
Mol. Mass.:
225.2857
SMILES:
N[C@@H]1C[C@H](Oc2ccccc2)c2ccccc12
: