Target
Sodium-dependent noradrenaline transporter
Ligand
BDBM50243103
Substrate
Meas. Tech.
ChEMBL_491609 (CHEMBL945185)
IC50
4000±n/a nM
Citation
 Wu, DPontillo, JChing, BHudson, SGao, YFleck, BAGogas, KWade, WS Discovery of a potent, selective, and less flexible selective norepinephrine reuptake inhibitor (sNRI). Bioorg Med Chem Lett 18:4224-7 (2008)  
Target
Name:
Sodium-dependent noradrenaline transporter
Synonyms:
Monoamine transporter NET Noradrenaline Transporter (NET) Norepinephrine transporter protein (NET) SLC6A2 Sodium-dependent noradrenaline transporter (NET) | Solute carrier family 6 member 2
Type:
Multi-pass membrane protein
Mol. Mass.:
69337.72
Organism:
Homo sapiens (Human)
Description:
P23975
Residue:
617
  
Inhibitor
Name:
BDBM50243103
Synonyms:
CHEMBL488222 | cis-3-(4-chlorophenoxy)-N-methyl-2,3-dihydro-1H-inden-1-amine
Type:
Small organic molecule
Emp. Form.:
C16H16ClNO
Mol. Mass.:
273.757
SMILES:
CN[C@@H]1C[C@H](Oc2ccc(Cl)cc2)c2ccccc12
: