Target
Sodium-dependent serotonin transporter
Ligand
BDBM50243103
Substrate
Meas. Tech.
ChEMBL_491608 (CHEMBL945184)
IC50
320±n/a nM
Citation
 Wu, DPontillo, JChing, BHudson, SGao, YFleck, BAGogas, KWade, WS Discovery of a potent, selective, and less flexible selective norepinephrine reuptake inhibitor (sNRI). Bioorg Med Chem Lett 18:4224-7 (2008)  
Target
Name:
Sodium-dependent serotonin transporter
Synonyms:
5-HT Transporter 5HTT SC6A4_HUMAN SLC6A4 Serotonin transporter (5HTT) Sodium-dependent serotonin transporter (SERT) | Solute carrier family 6 member 4
Type:
Multi-pass membrane protein
Mol. Mass.:
70322.51
Organism:
Homo sapiens (Human)
Description:
P31645
Residue:
630
  
Inhibitor
Name:
BDBM50243103
Synonyms:
CHEMBL488222 | cis-3-(4-chlorophenoxy)-N-methyl-2,3-dihydro-1H-inden-1-amine
Type:
Small organic molecule
Emp. Form.:
C16H16ClNO
Mol. Mass.:
273.757
SMILES:
CN[C@@H]1C[C@H](Oc2ccc(Cl)cc2)c2ccccc12
: