Target
Small conductance calcium-activated potassium channel protein 3
Ligand
BDBM50260153
Substrate
Meas. Tech.
ChEMBL_535545 (CHEMBL986171)
IC50
0.064±n/a nM
Citation
 Gentles, RGGrant-Young, KHu, SHuang, YPoss, MAAndres, CFiedler, TKnox, RLodge, NWeaver, CDHarden, DG Initial SAR studies on apamin-displacing 2-aminothiazole blockers of calcium-activated small conductance potassium channels. Bioorg Med Chem Lett 18:5316-9 (2008)  
Target
Name:
Small conductance calcium-activated potassium channel protein 3
Synonyms:
K3 KCNN3_HUMAN Small conductance calcium-activated potassium channel protein 3 (KCa2.3)
Type:
Protein
Mol. Mass.:
82053.75
Organism:
Homo sapiens (Human)
Description:
Q9UGI6
Residue:
731
  
Inhibitor
Name:
BDBM50260153
Synonyms:
Apamin Octadecapeptide venom
Type:
Small organic molecule
Emp. Form.:
C79H131N31O24S4
Mol. Mass.:
2027.339
SMILES:
CC(C)C[C@@H]1NC(=O)[C@H](C)NC(=O)[C@@H](NC(=O)[C@H](CCC(O)=O)NC(=O)[C@@H]2CCCN2C(=O)[C@H](C)NC(=O)[C@H](CCCCN)NC(=O)[C@@H]2CSSC[C@H](NC(=O)[C@H](CCCN=C(N)N)NC(=O)[C@H](CCCN=C(N)N)NC(=O)[C@H](C)NC(=O)[C@H](CSSC[C@H](N)C(=O)N[C@@H](CC(N)=O)C(=O)N2)NC1=O)C(=O)N[C@@H](CCC(N)=O)C(=O)N[C@@H](CCC(N)=O)C(=O)N[C@@H](Cc1cnc[nH]1)C(N)=O)[C@@H](C)O
: