Target
Sodium-dependent serotonin transporter
Ligand
BDBM50191624
Substrate
Meas. Tech.
ChEMBL_536731 (CHEMBL984525)
Ki
5.3±n/a nM
Citation
 Hatzenbuhler, NTBaudy, REvrard, DAFailli, AHarrison, BLLenicek, SMewshaw, RESaab, AShah, USze, JZhang, MZhou, DChlenov, MKagan, MGolembieski, JHornby, GLai, MSmith, DLSullivan, KMSchechter, LEAndree, TH Advances toward new antidepressants with dual serotonin transporter and 5-HT1A receptor affinity within a class of 3-aminochroman derivatives. Part 2. J Med Chem 51:6980-7004 (2008)  
Target
Name:
Sodium-dependent serotonin transporter
Synonyms:
5-HT Transporter 5HT transporter Anandamid membrane transporter, AMT Monoamine transporters; Norepinephrine & serotonin Slc6a4 Sodium-dependent serotonin transporter (SERT) | imipramine receptor
Type:
Multi-pass membrane protein
Mol. Mass.:
70168.43
Organism:
Rattus norvegicus (rat)
Description:
P31652
Residue:
630
  
Inhibitor
Name:
BDBM50191624
Synonyms:
(3S)-(+)-3-{Cyclobutyl[3-(5-fluoro-1H-indol-3-yl)propyl]amino}-8-fluorochromane-5-carboxamide CHEMBL208774
Type:
Small organic molecule
Emp. Form.:
C25H27F2N3O2
Mol. Mass.:
439.4976
SMILES:
NC(=O)c1ccc(F)c2OC[C@H](Cc12)N(CCCc1c[nH]c2ccc(F)cc12)C1CCC1
: