Target
Sodium-dependent serotonin transporter
Ligand
BDBM50191639
Substrate
Meas. Tech.
ChEMBL_536732 (CHEMBL984526)
IC50
386±n/a nM
Citation
 Hatzenbuhler, NTBaudy, REvrard, DAFailli, AHarrison, BLLenicek, SMewshaw, RESaab, AShah, USze, JZhang, MZhou, DChlenov, MKagan, MGolembieski, JHornby, GLai, MSmith, DLSullivan, KMSchechter, LEAndree, TH Advances toward new antidepressants with dual serotonin transporter and 5-HT1A receptor affinity within a class of 3-aminochroman derivatives. Part 2. J Med Chem 51:6980-7004 (2008)  
Target
Name:
Sodium-dependent serotonin transporter
Synonyms:
5-HT Transporter 5HTT SC6A4_HUMAN SLC6A4 Serotonin transporter (5HTT) Sodium-dependent serotonin transporter (SERT) | Solute carrier family 6 member 4
Type:
Multi-pass membrane protein
Mol. Mass.:
70322.51
Organism:
Homo sapiens (Human)
Description:
P31645
Residue:
630
  
Inhibitor
Name:
BDBM50191639
Synonyms:
CHEMBL378073 N-[3-(5-Fluoro-1H-indol-3-yl)propyl]-5-methoxy-N-propylchroman-3-amine | rac-[3-(5-fluoro-1H-indol-3-yl)-propyl]-(5-methoxy-chroman-3-yl)-propyl-amine
Type:
Small organic molecule
Emp. Form.:
C24H29FN2O2
Mol. Mass.:
396.4977
SMILES:
CCCN(CCCc1c[nH]c2ccc(F)cc12)C1COc2cccc(OC)c2C1
: