Target
Sodium-dependent serotonin transporter
Ligand
BDBM50274782
Substrate
Meas. Tech.
ChEMBL_536731 (CHEMBL984525)
Ki
2.4±n/a nM
Citation
 Hatzenbuhler, NTBaudy, REvrard, DAFailli, AHarrison, BLLenicek, SMewshaw, RESaab, AShah, USze, JZhang, MZhou, DChlenov, MKagan, MGolembieski, JHornby, GLai, MSmith, DLSullivan, KMSchechter, LEAndree, TH Advances toward new antidepressants with dual serotonin transporter and 5-HT1A receptor affinity within a class of 3-aminochroman derivatives. Part 2. J Med Chem 51:6980-7004 (2008)  
Target
Name:
Sodium-dependent serotonin transporter
Synonyms:
5-HT Transporter 5HT transporter Anandamid membrane transporter, AMT Monoamine transporters; Norepinephrine & serotonin Slc6a4 Sodium-dependent serotonin transporter (SERT) | imipramine receptor
Type:
Multi-pass membrane protein
Mol. Mass.:
70168.43
Organism:
Rattus norvegicus (rat)
Description:
P31652
Residue:
630
  
Inhibitor
Name:
BDBM50274782
Synonyms:
8-Fluoro-3-{[3-(5-fluoro-1H-indol-3-yl)propyl](propyl)amino}-N-methylchromane-5-carboxamide | CHEMBL457750
Type:
Small organic molecule
Emp. Form.:
C25H29F2N3O2
Mol. Mass.:
441.5135
SMILES:
CCCN(CCCc1c[nH]c2ccc(F)cc12)C1COc2c(F)ccc(C(=O)NC)c2C1
: