Target
Galanin receptor type 2
Ligand
BDBM50273356
Substrate
Meas. Tech.
ChEMBL_561975 (CHEMBL1010038)
Ki
28±n/a nM
Citation
 Bulaj, GGreen, BRLee, HKRobertson, CRWhite, KZhang, LSochanska, MFlynn, SPScholl, EAPruess, THSmith, MDWhite, HS Design, synthesis, and characterization of high-affinity, systemically-active galanin analogues with potent anticonvulsant activities. J Med Chem 51:8038-47 (2008)  
Target
Name:
Galanin receptor type 2
Synonyms:
GALNR2 GALR2_HUMAN Galanin receptor 2 Galanin receptor type 2 (GAL2-R) (GALR2).
Type:
Enzyme Catalytic Domain
Mol. Mass.:
41724.40
Organism:
Homo sapiens (Human)
Description:
Galanin R2 GALR2 HUMAN::O43603
Residue:
387
  
Inhibitor
Name:
BDBM50273356
Synonyms:
CHEMBL504914
Type:
Small organic molecule
Emp. Form.:
C104H174N24O22
Mol. Mass.:
2112.642
SMILES:
CCCCCCCCCCCCCCCC(=O)NCCCC[C@H](NC(=O)[C@H](CCCCN)NC(=O)[C@@H]1CCCN1C(=O)CNC(=O)[C@H](CC(C)C)NC(=O)[C@H](CC(C)C)NC(=O)[C@H](Cc1ccc(O)cc1)NC(=O)CNC(=O)[C@H](C)NC(=O)[C@H](CO)NC(=O)[C@H](CC(N)=O)NC(=O)[C@H](CC(C)C)NC(=O)[C@@H](NC(=O)[C@H](Cc1c[nH]c2ccccc12)NC(=O)CNC)[C@@H](C)O)C(=O)N[C@@H](CCCCN)C(=O)N[C@@H](CCCCN)C(N)=O
: