Target
Kappa-type opioid receptor
Ligand
BDBM50254570
Substrate
Meas. Tech.
ChEMBL_558749 (CHEMBL1019878)
Ki
0.390000±n/a nM
Citation
 Wentland, MPLou, RLu, QBu, YVanAlstine, MACohen, DJBidlack, JM Syntheses and opioid receptor binding properties of carboxamido-substituted opioids. Bioorg Med Chem Lett 19:203-8 (2008)  
Target
Name:
Kappa-type opioid receptor
Synonyms:
K-OR-1 Kappa-opioid receptor (KOR) Kappa-type opioid receptor (KOR) OPIATE Kappa OPRK1 kappa opioid receptor (KOR)
Type:
G Protein-Coupled Receptor (GPCR)
Mol. Mass.:
42648.76
Organism:
Homo sapiens (Human)
Description:
P41145
Residue:
380
  
Inhibitor
Name:
BDBM50254570
Synonyms:
(1S,9R,10S)-17-(cyclobutylmethyl)-10-hydroxy-17-azatetracyclo[7.5.3.0^{1,10}.0^{2,7}]heptadeca-2,4,6-triene-4-carboxamide | CHEMBL517779
Type:
Small organic molecule
Emp. Form.:
C22H30N2O2
Mol. Mass.:
354.4858
SMILES:
NC(=O)c1ccc2C[C@H]3N(CC4CCC4)CC[C@@]4(CCCC[C@@]34O)c2c1
: