Target
Mu-type opioid receptor
Ligand
BDBM50045776
Substrate
Meas. Tech.
ChEMBL_558757 (CHEMBL1019886)
Ki
0.440000±n/a nM
Citation
 Wentland, MPLou, RLu, QBu, YVanAlstine, MACohen, DJBidlack, JM Syntheses and opioid receptor binding properties of carboxamido-substituted opioids. Bioorg Med Chem Lett 19:203-8 (2008)  
Target
Name:
Mu-type opioid receptor
Synonyms:
M-OR-1 MOR-1 MUOR1 Mu opiate receptor OPRM1 hMOP | mu-type opioid receptor isoform MOR-1
Type:
G Protein-Coupled Receptor (GPCR)
Mol. Mass.:
44789.51
Organism:
Homo sapiens (Human)
Description:
P35372
Residue:
400
  
Inhibitor
Name:
BDBM50045776
Synonyms:
CHEMBL982 NALMEFENE ORF-11676 cid_5284594
Type:
Small organic molecule
Emp. Form.:
C21H25NO3
Mol. Mass.:
339.4281
SMILES:
Oc1ccc2C[C@H]3N(CC4CC4)CC[C@@]45[C@@H](Oc1c24)C(=C)CC[C@@]35O
: