Target
Transporter
Ligand
BDBM50136674
Substrate
Meas. Tech.
ChEMBL_559243 (CHEMBL1014662)
Ki
16±n/a nM
Citation
 Manning, JRSexton, TChilders, SRDavies, HM 1-Naphthyl and 4-indolyl arylalkylamines as selective monoamine reuptake inhibitors. Bioorg Med Chem Lett 19:58-61 (2008)  
Target
Name:
Transporter
Synonyms:
NE transporter Norepinephrine transporter(NET)
Type:
Multi-pass membrane protein
Mol. Mass.:
69236.90
Organism:
Rattus norvegicus (rat)
Description:
Q63380
Residue:
617
  
Inhibitor
Name:
BDBM50136674
Synonyms:
(3R)-N-methyl-3-(1-naphthyloxy)-3-(2-thienyl)propan-1-amine (R)-duloxetine LY248685
Type:
Small organic molecule
Emp. Form.:
C18H19NOS
Mol. Mass.:
297.415
SMILES:
CNCC[C@@H](Oc1cccc2ccccc12)c1cccs1
: