Target
Growth factor receptor-bound protein 2
Ligand
BDBM50264468
Substrate
Meas. Tech.
ChEMBL_539205 (CHEMBL1024709)
IC50
117700±n/a nM
Citation
 Long, YQXue, TSong, YLLiu, ZLHuang, SXYu, Q Synthesis and utilization of chiral alpha-methylated alpha-amino acids with a carboxyalkyl side chain in the design of novel Grb2-SH2 peptide inhibitors free of phosphotyrosine. J Med Chem 51:6371-80 (2008)  
Target
Name:
Growth factor receptor-bound protein 2
Synonyms:
ASH GRB2 adapter protein Grb2-SH2 | Growth factor receptor-bound protein 2
Type:
Protein
Mol. Mass.:
25205.04
Organism:
Homo sapiens (Human)
Description:
P62993
Residue:
217
  
Inhibitor
Name:
BDBM50264468
Synonyms:
CHEMBL461032 | N-Fmoc-(S)-(alpha-Me)Adi-Leu-Tyr-Ac6c-Asn-amide
Type:
Small organic molecule
Emp. Form.:
C48H61N7O11
Mol. Mass.:
912.0382
SMILES:
CC(C)C[C@H](NC(=O)[C@](C)(CCCC(O)=O)NC(=O)OCC1c2ccccc2-c2ccccc12)C(=O)N[C@@H](Cc1ccc(O)cc1)C(=O)NC1(CCCCC1)C(=O)N[C@@H](CC(N)=O)C(N)=O
: