Target
Growth factor receptor-bound protein 2
Ligand
BDBM50264465
Substrate
Meas. Tech.
ChEMBL_539205 (CHEMBL1024709)
IC50
5800±n/a nM
Citation
 Long, YQXue, TSong, YLLiu, ZLHuang, SXYu, Q Synthesis and utilization of chiral alpha-methylated alpha-amino acids with a carboxyalkyl side chain in the design of novel Grb2-SH2 peptide inhibitors free of phosphotyrosine. J Med Chem 51:6371-80 (2008)  
Target
Name:
Growth factor receptor-bound protein 2
Synonyms:
ASH GRB2 adapter protein Grb2-SH2 | Growth factor receptor-bound protein 2
Type:
Protein
Mol. Mass.:
25205.04
Organism:
Homo sapiens (Human)
Description:
P62993
Residue:
217
  
Inhibitor
Name:
BDBM50264465
Synonyms:
CHEMBL462230 | N-Fmoc-Adi-Leu-(3'-NH2-Tyr)-Ac6c-Glu-Asn-amide
Type:
Small organic molecule
Emp. Form.:
C47H60N8O11
Mol. Mass.:
913.0263
SMILES:
CC(C)C[C@H](NC(=O)[C@H](CCCC(O)=O)NC(=O)OCC1c2ccccc2-c2ccccc12)C(=O)N[C@@H](Cc1ccc(O)c(N)c1)C(=O)NC1(CCCCC1)C(=O)N[C@@H](CC(N)=O)C(N)=O
: