Target
Small conductance calcium-activated potassium channel protein 3
Ligand
BDBM50092131
Substrate
Meas. Tech.
ChEMBL_494974 (CHEMBL1008046)
Ki
1.4±n/a nM
Citation
 Sørensen, USStrøbaek, DChristophersen, PHougaard, CJensen, MLNielsen, EŘPeters, DTeuber, L Synthesis and structure-activity relationship studies of 2-(N-substituted)-aminobenzimidazoles as potent negative gating modulators ofsmall conductance Ca2+-activated K+ channels. J Med Chem 51:7625-34 (2009)  
Target
Name:
Small conductance calcium-activated potassium channel protein 3
Synonyms:
KCNN3_RAT SK3 | Small conductance calcium-activated potassium channel
Type:
PROTEIN
Mol. Mass.:
81476.29
Organism:
Rattus norvegicus
Description:
ChEMBL_494975
Residue:
732
  
Inhibitor
Name:
BDBM50092131
Synonyms:
1,7-diazonia-15,21-diazapentacyclo[20.6.2.27,14.08,13.023,28]dotriaconta-1(28),7(32),8,10,12,14(31),22,24,26,29-decaene CHEMBL612120 | UCL-1848
Type:
Small organic molecule
Emp. Form.:
C28H34N4
Mol. Mass.:
426.5953
SMILES:
C1CCN[c+]2ccn(CCCCCn3cc[c+](NCC1)c1ccccc31)c1ccccc21
: