Target
Small conductance calcium-activated potassium channel protein 3
Ligand
BDBM50199404
Substrate
Meas. Tech.
ChEMBL_494974 (CHEMBL1008046)
Ki
1500±n/a nM
Citation
 Sørensen, USStrøbaek, DChristophersen, PHougaard, CJensen, MLNielsen, EŘPeters, DTeuber, L Synthesis and structure-activity relationship studies of 2-(N-substituted)-aminobenzimidazoles as potent negative gating modulators ofsmall conductance Ca2+-activated K+ channels. J Med Chem 51:7625-34 (2009)  
Target
Name:
Small conductance calcium-activated potassium channel protein 3
Synonyms:
KCNN3_RAT SK3 | Small conductance calcium-activated potassium channel
Type:
PROTEIN
Mol. Mass.:
81476.29
Organism:
Rattus norvegicus
Description:
ChEMBL_494975
Residue:
732
  
Inhibitor
Name:
BDBM50199404
Synonyms:
1-(3,4-Dimethoxy-benzyl)-6,7-dimethoxy-2,2-dimethyl-1,2,3,4-tetrahydro-isoquinolinium iodide CHEMBL215370 N-methyl-laudanosine
Type:
Small organic molecule
Emp. Form.:
C22H30NO4
Mol. Mass.:
372.4774
SMILES:
COc1ccc(C[C@H]2c3cc(OC)c(OC)cc3CC[N+]2(C)C)cc1OC
: