Target
Small conductance calcium-activated potassium channel protein 3
Ligand
BDBM50377980
Substrate
Meas. Tech.
ChEMBL_494975 (CHEMBL1008047)
IC50
7000±n/a nM
Citation
 Sørensen, USStrøbaek, DChristophersen, PHougaard, CJensen, MLNielsen, EŘPeters, DTeuber, L Synthesis and structure-activity relationship studies of 2-(N-substituted)-aminobenzimidazoles as potent negative gating modulators ofsmall conductance Ca2+-activated K+ channels. J Med Chem 51:7625-34 (2009)  
Target
Name:
Small conductance calcium-activated potassium channel protein 3
Synonyms:
KCNN3_RAT SK3 | Small conductance calcium-activated potassium channel
Type:
PROTEIN
Mol. Mass.:
81476.29
Organism:
Rattus norvegicus
Description:
ChEMBL_494975
Residue:
732
  
Inhibitor
Name:
BDBM50377980
Synonyms:
CHEMBL558625
Type:
Small organic molecule
Emp. Form.:
C21H20NO6
Mol. Mass.:
382.3861
SMILES:
C[N+]1(C)CCc2cc3OCOc3cc2[C@H]1[C@@H]1OC(=O)c2c1ccc1OCOc21
: