Target
5-hydroxytryptamine receptor 1A
Ligand
BDBM50275321
Substrate
Meas. Tech.
ChEMBL_496147 (CHEMBL1000136)
Ki
815±n/a nM
Citation
 Berardi, FAbate, CFerorelli, Sde Robertis, AFLeopoldo, MColabufo, NANiso, MPerrone, R Novel 4-(4-aryl)cyclohexyl-1-(2-pyridyl)piperazines as Delta(8)-Delta(7) sterol isomerase (emopamil binding protein) selective ligands with antiproliferative activity. J Med Chem 51:7523-31 (2009)  
Target
Name:
5-hydroxytryptamine receptor 1A
Synonyms:
5-HT-1A 5-HT1A 5-hydroxytryptamine receptor 1A (5HT1A) 5ht1a Htr1a Serotonin 1a (5-HT1a) receptor/Adrenergic receptor alpha-1 | Serotonin receptor 1A
Type:
G Protein-Coupled Receptor (GPCR)
Mol. Mass.:
46445.29
Organism:
Rattus norvegicus (rat)
Description:
Binding assays were performed using rat hippocampal membranes.
Residue:
422
  
Inhibitor
Name:
BDBM50275321
Synonyms:
CHEMBL521350 | cis-1-(4-(3-methoxyphenyl)cyclohexyl)-4-(pyridin-2-yl)piperazine
Type:
Small organic molecule
Emp. Form.:
C22H29N3O
Mol. Mass.:
351.4852
SMILES:
COc1cccc(c1)[C@@H]1CC[C@@H](CC1)N1CCN(CC1)c1ccccn1
: