Target
3-beta-hydroxysteroid-Delta(8),Delta(7)-isomerase
Ligand
BDBM50275322
Substrate
Meas. Tech.
ChEMBL_496150 (CHEMBL1000139)
Ki
33±n/a nM
Citation
 Berardi, FAbate, CFerorelli, Sde Robertis, AFLeopoldo, MColabufo, NANiso, MPerrone, R Novel 4-(4-aryl)cyclohexyl-1-(2-pyridyl)piperazines as Delta(8)-Delta(7) sterol isomerase (emopamil binding protein) selective ligands with antiproliferative activity. J Med Chem 51:7523-31 (2009)  
Target
Name:
3-beta-hydroxysteroid-Delta(8),Delta(7)-isomerase
Synonyms:
EBP | EBP_CAVPO
Type:
PROTEIN
Mol. Mass.:
26684.52
Organism:
Cavia porcellus
Description:
ChEMBL_203193
Residue:
229
  
Inhibitor
Name:
BDBM50275322
Synonyms:
CHEMBL485929 | cis-1-(4-(4-methoxyphenyl)cyclohexyl)-4-(pyridin-2-yl)piperazine
Type:
Small organic molecule
Emp. Form.:
C22H29N3O
Mol. Mass.:
351.4852
SMILES:
COc1ccc(cc1)[C@@H]1CC[C@@H](CC1)N1CCN(CC1)c1ccccn1
: