Target
Disintegrin and metalloproteinase domain-containing protein 17
Ligand
BDBM50247607
Substrate
Meas. Tech.
ChEMBL_495052 (CHEMBL1003624)
IC50
8±n/a nM
Citation
 DasGupta, SMurumkar, PRGiridhar, RYadav, MR Current perspective of TACE inhibitors: a review. Bioorg Med Chem 17:444-59 (2009)  
Target
Name:
Disintegrin and metalloproteinase domain-containing protein 17
Synonyms:
ADA17_HUMAN CSVP Disintegrin and metalloproteinase domain-containing protein 17 (ADAM17) TNF-alpha convertase TNF-alpha-converting enzyme (TACE) Tumor necrosis factor-α converting enzyme (TACE)
Type:
Enzyme
Mol. Mass.:
93007.89
Organism:
Homo sapiens (Human)
Description:
Residue:
824
  
Inhibitor
Name:
BDBM50247607
Synonyms:
(1S,2S)-N1-hydroxy-N2-(4-((2-methylquinolin-4-yloxy)methyl)phenyl)cyclohexane-1,2-dicarboxamide | CHEMBL491084
Type:
Small organic molecule
Emp. Form.:
C25H27N3O4
Mol. Mass.:
433.4996
SMILES:
Cc1cc(OCc2ccc(NC(=O)[C@H]3CCCC[C@@H]3C(=O)NO)cc2)c2ccccc2n1
: