Target
5-hydroxytryptamine receptor 6
Ligand
BDBM34142
Substrate
Meas. Tech.
ChEMBL_517120 (CHEMBL989583)
Ki
16±n/a nM
Citation
 Alcalde, EMesquida, NLópez-Pérez, SFrigola, JMercè, R Indene-based scaffolds. 2. An indole-indene switch: discovery of novel indenylsulfonamides as 5-HT6 serotonin receptor agonists. J Med Chem 52:675-87 (2009)  
Target
Name:
5-hydroxytryptamine receptor 6
Synonyms:
5-HT-6 5-hydroxytryptamine receptor 6 (5-HT-6) 5-hydroxytryptamine receptor 6 (5HT6) HTR6 Serotonin 6 (5-HT6) receptor | Serotonin Receptor 6
Type:
G Protein-Coupled Receptor (GPCR)
Mol. Mass.:
46968.43
Organism:
Homo sapiens (Human)
Description:
P50406
Residue:
440
  
Inhibitor
Name:
BDBM34142
Synonyms:
2-ethyl-5-methoxy-N,N-dimethyltryptamine EDMT [2-(2-ethyl-5-methoxy-1H-indol-3-yl)ethyl]dimethylamine, 6
Type:
Small organic molecule
Emp. Form.:
C15H22N2O
Mol. Mass.:
246.348
SMILES:
CCc1[nH]c2ccc(OC)cc2c1CCN(C)C
: