Target
D(3) dopamine receptor
Ligand
BDBM50378019
Substrate
Meas. Tech.
ChEMBL_563523 (CHEMBL961810)
Ki
0.44±n/a nM
Citation
 Newman, AHGrundt, PCyriac, GDeschamps, JRTaylor, MKumar, RHo, DLuedtke, RR N-(4-(4-(2,3-dichloro- or 2-methoxyphenyl)piperazin-1-yl)butyl)heterobiarylcarboxamides with functionalized linking chains as high affinity and enantioselective D3 receptor antagonists. J Med Chem 52:2559-70 (2009)  
Target
Name:
D(3) dopamine receptor
Synonyms:
DOPAMINE D3 DRD3_HUMAN Dopamine D3 receptor (D3) Dopamine receptor Dopamine receptor D3
Type:
Mol. Mass.:
44243.43
Organism:
Homo sapiens (Human)
Description:
Residue:
400
  
Inhibitor
Name:
BDBM50378019
Synonyms:
CHEMBL1627323
Type:
Small organic molecule
Emp. Form.:
C23H24Cl2N4O
Mol. Mass.:
443.369
SMILES:
Clc1cccc(N2CCN(C\C=C\CNC(=O)c3cc4ccccc4[nH]3)CC2)c1Cl
: