Target
Hydroxycarboxylic acid receptor 2
Ligand
BDBM50273099
Substrate
Meas. Tech.
ChEMBL_501320 (CHEMBL971506)
IC50
1500±n/a nM
Citation
 Imbriglio, JEChang, SLiang, RRaghavan, SSchmidt, DSmenton, ATria, SSchrader, TOJung, JKEsser, CTaggart, AKCheng, KCarballo-Jane, EGerard Waters, MTata, JRColletti, SL GPR109a agonists. Part 1: 5-Alkyl and 5-aryl-pyrazole-tetrazoles as agonists of the human orphan G-protein coupled receptor GPR109a. Bioorg Med Chem Lett 19:2121-4 (2009)  
Target
Name:
Hydroxycarboxylic acid receptor 2
Synonyms:
G-protein coupled receptor 109A GPR109A HCAR2 HM74A NIACR1 Nicotinic acid receptor 1
Type:
G Protein-Coupled Receptor (GPCR)
Mol. Mass.:
41868.22
Organism:
Homo sapiens (Human)
Description:
Membranes from CHO cells expressing the recombinant human GPR109A were used in competition binding assay.
Residue:
363
  
Inhibitor
Name:
BDBM50273099
Synonyms:
3-(1H-tetrazol-5-yl)-1,4,5,6-tetrahydrocyclopenta[c]pyrazole CHEMBL456145 | MK-0354
Type:
Small organic molecule
Emp. Form.:
C7H8N6
Mol. Mass.:
176.1786
SMILES:
C1Cc2[nH]nc(c2C1)-c1nnn[nH]1
: