Target
Aurora kinase A
Ligand
BDBM12982
Substrate
Meas. Tech.
ChEMBL_501648 (CHEMBL993738)
IC50
9±n/a nM
Citation
 Pollard, JRMortimore, M Discovery and development of aurora kinase inhibitors as anticancer agents. J Med Chem 52:2629-51 (2009)  
Target
Name:
Aurora kinase A
Synonyms:
AIK ARK1 AURKA AYK1 Aurora kinase A (AURA) Aurora kinase A (Aurora A) Aurora-related kinase 1 BTAK Breast-tumor-amplified kinase STK15 Serine/threonine kinase 15 Serine/threonine-protein kinase aurora A hARK1
Type:
Serine/threonine-protein kinase
Mol. Mass.:
45830.98
Organism:
Homo sapiens (Human)
Description:
O14965
Residue:
403
  
Inhibitor
Name:
BDBM12982
Synonyms:
5-Amido-pyrrolopyrazole 9a N-{5-[(2R)-2-fluoro-2-phenylacetyl]-1H,4H,5H,6H-pyrrolo[3,4-c]pyrazol-3-yl}-4-(4-methylpiperazin-1-yl)benzamide
Type:
Small organic molecule
Emp. Form.:
C25H27FN6O2
Mol. Mass.:
462.5193
SMILES:
CN1CCN(CC1)c1ccc(cc1)C(=O)Nc1[nH]nc2CN(Cc12)C(=O)[C@H](F)c1ccccc1
: