Target
Aurora kinase B
Ligand
BDBM50277638
Substrate
Meas. Tech.
ChEMBL_501649 (CHEMBL993739)
IC50
18±n/a nM
Citation
 Pollard, JRMortimore, M Discovery and development of aurora kinase inhibitors as anticancer agents. J Med Chem 52:2629-51 (2009)  
Target
Name:
Aurora kinase B
Synonyms:
AIK2 AIM1 ARK2 AURKB_HUMAN Aurora B-INCENP Aurora kinase B (AURKB) STK-1 STK12 Serine/threonine-protein kinase aurora B
Type:
Protein
Mol. Mass.:
39327.72
Organism:
Homo sapiens (Human)
Description:
Q96GD4
Residue:
344
  
Inhibitor
Name:
BDBM50277638
Synonyms:
CHEMBL482779 | N-(4-(4-(5-methyl-1H-pyrazol-3-ylamino)-6-(piperazin-1-yl)pyrimidin-2-ylthio)phenyl)propionamide
Type:
Small organic molecule
Emp. Form.:
C21H26N8OS
Mol. Mass.:
438.549
SMILES:
CCC(=O)Nc1ccc(Sc2nc(Nc3cc(C)n[nH]3)cc(n2)N2CCNCC2)cc1
: