Target
Cannabinoid receptor 2
Ligand
BDBM50258604
Substrate
Meas. Tech.
ChEMBL_523689 (CHEMBL998034)
Ki
0.7±n/a nM
Citation
 Manera, CSaccomanni, GAdinolfi, BBenetti, VLigresti, ACascio, MGTuccinardi, TLucchesi, VMartinelli, ANieri, PMasini, EDi Marzo, VFerrarini, PL Rational design, synthesis, and pharmacological properties of new 1,8-naphthyridin-2(1H)-on-3-carboxamide derivatives as highly selective cannabinoid-2 receptor agonists. J Med Chem 52:3644-51 (2009)  
Target
Name:
Cannabinoid receptor 2
Synonyms:
CANNABINOID CB2 CB2 CB2B CNR2_HUMAN Cannabinoid CB2 receptor Cannabinoid receptor 2 (CB2R) | hCB2
Type:
G Protein-Coupled Receptor (GPCR)
Mol. Mass.:
39690.94
Organism:
Homo sapiens (Human)
Description:
P34972
Residue:
360
  
Inhibitor
Name:
BDBM50258604
Synonyms:
CHEMBL467896 | N-Cycloheptyl-1-(p-fluorobenzyl)-1,8-naphthyridin-2(1H)-on-3-carboxamide
Type:
Small organic molecule
Emp. Form.:
C23H24FN3O2
Mol. Mass.:
393.454
SMILES:
Fc1ccc(Cn2c3ncccc3cc(C(=O)NC3CCCCCC3)c2=O)cc1
: