Target
P2Y purinoceptor 12
Ligand
BDBM50227015
Substrate
Meas. Tech.
ChEMBL_523462 (CHEMBL995340)
Ki
>10000±n/a nM
Citation
 Baqi, YAtzler, KKöse, MGlänzel, MMüller, CE High-affinity, non-nucleotide-derived competitive antagonists of platelet P2Y12 receptors. J Med Chem 52:3784-93 (2009)  
Target
Name:
P2Y purinoceptor 12
Synonyms:
ADP-glucose receptor HORK3 P2T(AC) P2Y(AC) P2Y(cyc) P2Y12 platelet ADP receptor Purinergic receptor P2Y12 | SP1999
Type:
Enzyme
Mol. Mass.:
39458.48
Organism:
Homo sapiens (Human)
Description:
Q9H244
Residue:
342
  
Inhibitor
Name:
BDBM50227015
Synonyms:
CHEMBL271688 sodium 4-(4-acetamidophenylamino)-1-amino-9,10-dioxo-9,10-dihydroanthracene-2-sulfonate
Type:
Small organic molecule
Emp. Form.:
C22H16N3O6S
Mol. Mass.:
450.444
SMILES:
CC(=O)Nc1ccc(Nc2cc(c(N)c3C(=O)c4ccccc4C(=O)c23)S([O-])(=O)=O)cc1
: