Target
P2Y purinoceptor 12
Ligand
BDBM50268917
Substrate
Meas. Tech.
ChEMBL_523462 (CHEMBL995340)
Ki
63±n/a nM
Citation
 Baqi, YAtzler, KKöse, MGlänzel, MMüller, CE High-affinity, non-nucleotide-derived competitive antagonists of platelet P2Y12 receptors. J Med Chem 52:3784-93 (2009)  
Target
Name:
P2Y purinoceptor 12
Synonyms:
ADP-glucose receptor HORK3 P2T(AC) P2Y(AC) P2Y(cyc) P2Y12 platelet ADP receptor Purinergic receptor P2Y12 | SP1999
Type:
Enzyme
Mol. Mass.:
39458.48
Organism:
Homo sapiens (Human)
Description:
Q9H244
Residue:
342
  
Inhibitor
Name:
BDBM50268917
Synonyms:
CHEMBL446904 | Disodium 1-Amino-4-[4-phenoxy-3-sulfophenylamino]-9,10-dioxo-9,10-dihydroanthracene-2-sulfonate
Type:
Small organic molecule
Emp. Form.:
C26H16N2O9S2
Mol. Mass.:
564.544
SMILES:
Nc1c(cc(Nc2ccc(Oc3ccccc3)c(c2)S([O-])(=O)=O)c2C(=O)c3ccccc3C(=O)c12)S([O-])(=O)=O
: