Target
Melanocortin receptor 3
Ligand
BDBM50184359
Substrate
Meas. Tech.
ChEMBL_523573 (CHEMBL997223)
IC50
1.3±n/a nM
Citation
 Qu, HCai, MMayorov, AVGrieco, PZingsheim, MTrivedi, DHruby, VJ Substitution of arginine with proline and proline derivatives in melanocyte-stimulating hormones leads to selectivity for human melanocortin 4 receptor. J Med Chem 52:3627-35 (2009)  
Target
Name:
Melanocortin receptor 3
Synonyms:
MC3-R MC3R_HUMAN Melanocortin receptor (M3 and M4)
Type:
Enzyme
Mol. Mass.:
36044.86
Organism:
Homo sapiens (Human)
Description:
P41968
Residue:
323
  
Inhibitor
Name:
BDBM50184359
Synonyms:
(3S,6S,9R,12S,15S,23S)-15-((S)-2-acetylamino-hexanoylamino)-9-benzyl-6-(3-guanidino-propyl)-12-(3H-imidazol-4-ylmethyl)-3-(1H-indol-3-ylmethyl)-2,5,8,11,14,17-hexaoxo-1,4,7,10,13,18hexaaza-cyclotricosane-23-carboxylic acid amide Ac-Nle-c[Asp-His-DPhe-Arg-Trp-Lys]-NH2 MT-II | ebi_340792
Type:
Small organic molecule
Emp. Form.:
C50H69N15O9
Mol. Mass.:
1024.178
SMILES:
CCCC[C@H](NC(C)=O)C(=O)N[C@H]1CC(=O)NCCCC[C@H](NC(=O)[C@H](Cc2c[nH]c3ccccc23)NC(=O)[C@H](CCCN=C(N)N)NC(=O)[C@@H](Cc2ccccc2)NC(=O)[C@H](Cc2cnc[nH]2)NC1=O)C(N)=O
: