Target
Melanocyte-stimulating hormone receptor
Ligand
BDBM50268801
Substrate
Meas. Tech.
ChEMBL_523576 (CHEMBL997226)
IC50
2.3±n/a nM
Citation
 Qu, HCai, MMayorov, AVGrieco, PZingsheim, MTrivedi, DHruby, VJ Substitution of arginine with proline and proline derivatives in melanocyte-stimulating hormones leads to selectivity for human melanocortin 4 receptor. J Med Chem 52:3627-35 (2009)  
Target
Name:
Melanocyte-stimulating hormone receptor
Synonyms:
MC1-R MSH-R MSHR_HUMAN Melanocortin receptor (M1 and M4) Melanocortin receptor 1 (MC1-R) | Melanocortin receptor 1 (MC1R)
Type:
Enzyme
Mol. Mass.:
34717.23
Organism:
Homo sapiens (Human)
Description:
Q01726
Residue:
317
  
Inhibitor
Name:
BDBM50268801
Synonyms:
Ac-Nle-c[Asp-trans-4-guanidinyl-Pro-DNal(2')-Arg-Trp-Lys]-NH2 | CHEMBL501592
Type:
Small organic molecule
Emp. Form.:
C54H74N16O9
Mol. Mass.:
1091.2672
SMILES:
CCCC[C@H](NC(C)=O)C(=O)N[C@H]1CC(=O)NCCCC[C@H](NC(=O)[C@H](Cc2c[nH]c3ccccc23)NC(=O)[C@H](CCCN=C(N)N)NC(=O)[C@@H](Cc2ccc3ccccc3c2)NC(=O)[C@@H]2C[C@H](CN2C1=O)N=C(N)N)C(N)=O
: