Target
Adenosine receptor A1
Ligand
BDBM50268129
Substrate
Meas. Tech.
ChEMBL_520176 (CHEMBL947864)
Ki
386±n/a nM
Citation
 Borrmann, THinz, SBertarelli, DCLi, WFlorin, NCScheiff, ABMüller, CE 1-alkyl-8-(piperazine-1-sulfonyl)phenylxanthines: development and characterization of adenosine A2B receptor antagonists and a new radioligand with subnanomolar affinity and subtype specificity. J Med Chem 52:3994-4006 (2009)  
Target
Name:
Adenosine receptor A1
Synonyms:
AA1R_RAT ADENOSINE A1 high Adenosine A1 receptor (A1) Adenosine receptors A1 | Adora1
Type:
Protein
Mol. Mass.:
36704.13
Organism:
Rattus norvegicus (rat)
Description:
Residue:
326
  
Inhibitor
Name:
BDBM50268129
Synonyms:
8-(4-(4-(4-chlorobenzyl)piperazin-1-ylsulfonyl)phenyl)-1-propyl-1H-purine-2,6(3H,7H)-dione | CHEMBL482436
Type:
Small organic molecule
Emp. Form.:
C25H27ClN6O4S
Mol. Mass.:
543.038
SMILES:
CCCn1c(=O)[nH]c2nc([nH]c2c1=O)-c1ccc(cc1)S(=O)(=O)N1CCN(Cc2ccc(Cl)cc2)CC1
: