Target
Adenosine receptor A2b
Ligand
BDBM50268085
Substrate
Meas. Tech.
ChEMBL_520168 (CHEMBL947856)
Ki
1.2±n/a nM
Citation
 Borrmann, THinz, SBertarelli, DCLi, WFlorin, NCScheiff, ABMüller, CE 1-alkyl-8-(piperazine-1-sulfonyl)phenylxanthines: development and characterization of adenosine A2B receptor antagonists and a new radioligand with subnanomolar affinity and subtype specificity. J Med Chem 52:3994-4006 (2009)  
Target
Name:
Adenosine receptor A2b
Synonyms:
AA2BR_HUMAN ADORA2B Adenosine receptors A2b | Adenosine receptors; A2a & A2b
Type:
G Protein-Coupled Receptor (GPCR)
Mol. Mass.:
36341.22
Organism:
Homo sapiens (Human)
Description:
Residue:
332
  
Inhibitor
Name:
BDBM50268085
Synonyms:
CHEMBL490262 N-(2-hydroxyethyl)-2-(4-(1-methyl-2,4-dioxo-3-propyl-2,3,4,5-tetrahydro-1H-pyrrolo[3,2-d]pyrimidin-6-yl)phenoxy)acetamide | SB-298
Type:
Small organic molecule
Emp. Form.:
C20H24N4O5
Mol. Mass.:
400.4284
SMILES:
CCCn1c(=O)n(C)c2cc([nH]c2c1=O)-c1ccc(OCC(=O)NCCO)cc1
: