Target
Heat shock protein HSP 90-beta
Ligand
BDBM15359
Substrate
Meas. Tech.
ChEMBL_498597 (CHEMBL1021924)
Kd
1300±n/a nM
Citation
 Tian, ZQWang, ZMacMillan, KSZhou, YCarreras, CWMueller, TMyles, DCLiu, Y Potent cytotoxic C-11 modified geldanamycin analogues. J Med Chem 52:3265-73 (2009)  
Target
Name:
Heat shock protein HSP 90-beta
Synonyms:
HS90B_HUMAN HSP 90 HSP90B HSPCB Heat shock protein HSP 90 (Hsp90)
Type:
Molecular Chaperone
Mol. Mass.:
83229.45
Organism:
Homo sapiens (Human)
Description:
P08238
Residue:
724
  
Inhibitor
Name:
BDBM15359
Synonyms:
(4E,6Z,8S,9S,10E,12S,13R,14S,16R)-13-hydroxy-8,14-dimethoxy-4,10,12,16-tetramethyl-3,20,22-trioxo-19-(prop-2-en-1-ylamino)-2-azabicyclo[16.3.1]docosa-1(21),4,6,10,18-pentaen-9-yl carbamate 17-AAG CHEMBL109480 Tanespimycin
Type:
Small organic molecule
Emp. Form.:
C31H43N3O8
Mol. Mass.:
585.6884
SMILES:
CO[C@H]1C[C@H](C)Cc2c(O)c(NC(=O)C(C)=CC=C[C@H](OC)[C@@H](OC(N)=O)\C(C)=C\[C@H](C)[C@H]1O)cc(O)c2N=CC=C
: