Target
Tyrosine-protein phosphatase non-receptor type 1
Ligand
BDBM50294526
Substrate
Meas. Tech.
ChEMBL_575586 (CHEMBL1036431)
IC50
870±n/a nM
Citation
 Seo, CSohn, JHAhn, JSYim, JHLee, HKOh, H Protein tyrosine phosphatase 1B inhibitory effects of depsidone and pseudodepsidone metabolites from the Antarctic lichen Stereocaulon alpinum. Bioorg Med Chem Lett 19:2801-3 (2009)  
Target
Name:
Tyrosine-protein phosphatase non-receptor type 1
Synonyms:
PTN1_HUMAN PTPN1 Protein tyrosine phosphatase-1B (PTP1B) Protein-tyrosine phosphatase 1B (PTP1B) Tyrosine-protein phosphatase non-receptor type 1 (PTP1B)
Type:
Protein phosphatase
Mol. Mass.:
49963.76
Organism:
Homo sapiens (Human)
Description:
Human recombinant GST-fusion PTP1B (1-435).
Residue:
435
  
Inhibitor
Name:
BDBM50294526
Synonyms:
CHEMBL551842 lobaric acid
Type:
Small organic molecule
Emp. Form.:
C25H28O8
Mol. Mass.:
456.485
SMILES:
CCCCCc1c2Oc3cc(OC)cc(C(=O)CCCC)c3C(=O)Oc2cc(O)c1C(O)=O
: